{"text_format":"1","workbook":"xlsx","n_sheets":8,"sheets":["Instructions","Change Log","Dashboard","Facility Information","Tank Systems","Equipment","Flash Test Results","Lists"],"not_rendered":{"charts":0,"images":0,"macros":1,"external_links":1,"defined_names":24,"comments":0,"pivot_tables":0},"unopened":[],"bounds":{"document_bytes":16777216,"sheet_cells":100000,"rows_first":2000,"rows_last":500,"rows_between":2000,"halvings":0,"cell_chars":16384,"cell_head_chars":4096},"cells_cut":0,"cells_raw":0,"read":"whole","date_system":"1900"}

{"sheet":"Instructions","index":0,"n_rows":11,"n_cols":2,"rows_kept":11,"cut":false,"hidden":false,"merged":[]}
[]
[null,"Instructions for Using This Workbook"]
[]
[null,"This workbook is used to report oil and gas facility information to the Air Resources Board and local air districts in accordance with the Air Resources Board regulation entitled \"Greenhouse Gas Emission Standards for Crude Oil and Natural Gas Production Facilities.\"  "]
[]
[null,"Cells within this workbook have been locked to prevent adding or deleting rows or columns.  Please do not alter the rows or columns in this workbook or it may make the entire workbook unusable."]
[]
[null,"1.  Enter the facility information.  This is the first step to completing this workbook.  All facility and preparer information must be  entered before data entry may begin.  After the facility information is entered, additional data entry form buttons will appear in the main dashboard."]
[null,"2.  Enter or create Tank System ID numbers for the facility along with the number of wells and throughput for each system.  If the facility does not have a tank system, enter the number of wells and throughput for the facility, then proceed to the Equipment Form to enter equipment.  If the facility has one or more Tank System IDs, an additional menu button for Flash Analysis Test Data will appear in the main dashboard."]
[null,"3. Enter the equipment found at the facility.  The types of equipment that require data entry can be found in the dropdown menu.  Please do not input other types of equipment.  Depending on the equipment type chosen, different cells will be highlighted and other cells will be blacked out to signify which cells require data input.  When inputting individual tanks at the facility, use the dropdown menu to link the tanks to the Tank System ID or you may pick N/A if the tanks are not associated with a tank system.  "]
[null,"4. Enter Flash Analysis test data.  Input the laboratory results and calculation results in the form where provided.  Please use the dropdown menu to link the test data to the appropriate Tank System ID to ensure the data is link to the proper system."]

{"sheet":"Change Log","index":1,"n_rows":2,"n_cols":8,"rows_kept":2,"cut":false,"hidden":true,"merged":[]}
[null,"Facility Information",null,"Tank Systems",null,"Equipment",null,"Flash Test Results"]
["Initial Registration",{"$f":"SheetNumber1(B1)","v":{"$error":"#VALUE!"}},null,{"$f":"SheetNumber1(D1)","v":{"$error":"#VALUE!"}},null,{"$f":"SheetNumber1(F1)","v":{"$error":"#VALUE!"}},null,{"$f":"SheetNumber1(H1)","v":{"$error":"#VALUE!"}}]

{"sheet":"Dashboard","index":2,"n_rows":24,"n_cols":15,"rows_kept":24,"cut":false,"hidden":false,"merged":[]}
[]
[]
[]
[]
[]
[]
[]
[]
[]
[]
[]
[]
[null,{"$f":"COUNTIF('Tank Systems'!$C$6:$C$206,Lists!A2)&\": \"&Lists!A2","v":"0: Crude Oil Production"},null,null,null,null,null,{"$f":"IF(IF(ISNA(VLOOKUP(Lists!C2,Equipment!$B$5:$C$497,2,FALSE)),0,VLOOKUP(Lists!C2,Equipment!$B$5:$C$497,2,FALSE))=0,COUNTIF(Equipment!$B$5:$B$497,Lists!C2),VLOOKUP(Lists!C2,Equipment!$B$5:$C$497,2,FALSE))&\": \"&Lists!C2","v":"0: Centrifugal Natural Gas Compressor"},null,null,null,null,{"$f":"SUMPRODUCT((MONTH('Flash Test Results'!$C$9:$C$109)=MONTH(DATEVALUE(N13&\" 1\")))*('Flash Test Results'!$C$9:$C$109<>\"\"))&\": \"&N13&\" \"&'Facility Information'!$C$32","v":"0: Jan "},"Jan",0]
[null,{"$f":"COUNTIF('Tank Systems'!$C$6:$C$206,Lists!A3)&\": \"&Lists!A3","v":"0: Natural Gas Production"},null,null,null,null,null,{"$f":"IF(IF(ISNA(VLOOKUP(Lists!C3,Equipment!$B$5:$C$497,2,FALSE)),0,VLOOKUP(Lists!C3,Equipment!$B$5:$C$497,2,FALSE))=0,COUNTIF(Equipment!$B$5:$B$497,Lists!C3),VLOOKUP(Lists!C3,Equipment!$B$5:$C$497,2,FALSE))&\": \"&Lists!C3","v":"0: Continuous High Bleed Pneumatic Devices"},null,null,null,null,{"$f":"SUMPRODUCT((MONTH('Flash Test Results'!$C$9:$C$109)=MONTH(DATEVALUE(N14&\" 1\")))*('Flash Test Results'!$C$9:$C$109<>\"\"))&\": \"&N14&\" \"&'Facility Information'!$C$32","v":"0: Feb "},"Feb",1]
[null,{"$f":"COUNTIF('Tank Systems'!$C$6:$C$206,Lists!A4)&\": \"&Lists!A4","v":"0: Natural Gas Storage"},null,null,null,null,null,{"$f":"IF(IF(ISNA(VLOOKUP(Lists!C4,Equipment!$B$5:$C$497,2,FALSE)),0,VLOOKUP(Lists!C4,Equipment!$B$5:$C$497,2,FALSE))=0,COUNTIF(Equipment!$B$5:$B$497,Lists!C4),VLOOKUP(Lists!C4,Equipment!$B$5:$C$497,2,FALSE))&\": \"&Lists!C4","v":"0: Continuous Low Bleed Pneumatic Devices"},null,null,null,null,{"$f":"SUMPRODUCT((MONTH('Flash Test Results'!$C$9:$C$109)=MONTH(DATEVALUE(N15&\" 1\")))*('Flash Test Results'!$C$9:$C$109<>\"\"))&\": \"&N15&\" \"&'Facility Information'!$C$32","v":"0: Mar "},"Mar",2]
[null,null,null,null,null,null,null,{"$f":"IF(IF(ISNA(VLOOKUP(Lists!C5,Equipment!$B$5:$C$497,2,FALSE)),0,VLOOKUP(Lists!C5,Equipment!$B$5:$C$497,2,FALSE))=0,COUNTIF(Equipment!$B$5:$B$497,Lists!C5),VLOOKUP(Lists!C5,Equipment!$B$5:$C$497,2,FALSE))&\": \"&Lists!C5","v":"0: Intermittent Bleed Pneumatic Devices"},null,null,null,null,{"$f":"SUMPRODUCT((MONTH('Flash Test Results'!$C$9:$C$109)=MONTH(DATEVALUE(N16&\" 1\")))*('Flash Test Results'!$C$9:$C$109<>\"\"))&\": \"&N16&\" \"&'Facility Information'!$C$32","v":"0: Apr "},"Apr",3]
[null,null,null,null,null,null,null,{"$f":"IF(IF(ISNA(VLOOKUP(Lists!C6,Equipment!$B$5:$C$497,2,FALSE)),0,VLOOKUP(Lists!C6,Equipment!$B$5:$C$497,2,FALSE))=0,COUNTIF(Equipment!$B$5:$B$497,Lists!C6),VLOOKUP(Lists!C6,Equipment!$B$5:$C$497,2,FALSE))&\": \"&Lists!C6","v":"0: Pneumatic Pumps"},null,null,null,null,{"$f":"SUMPRODUCT((MONTH('Flash Test Results'!$C$9:$C$109)=MONTH(DATEVALUE(N17&\" 1\")))*('Flash Test Results'!$C$9:$C$109<>\"\"))&\": \"&N17&\" \"&'Facility Information'!$C$32","v":"0: May "},"May",4]
[null,null,null,null,null,null,null,{"$f":"IF(IF(ISNA(VLOOKUP(Lists!C7,Equipment!$B$5:$C$497,2,FALSE)),0,VLOOKUP(Lists!C7,Equipment!$B$5:$C$497,2,FALSE))=0,COUNTIF(Equipment!$B$5:$B$497,Lists!C7),VLOOKUP(Lists!C7,Equipment!$B$5:$C$497,2,FALSE))&\": \"&Lists!C7","v":"0: Pond"},null,null,null,null,{"$f":"SUMPRODUCT((MONTH('Flash Test Results'!$C$9:$C$109)=MONTH(DATEVALUE(N18&\" 1\")))*('Flash Test Results'!$C$9:$C$109<>\"\"))&\": \"&N18&\" \"&'Facility Information'!$C$32","v":"0: Jun "},"Jun",5]
[null,null,null,null,null,null,null,{"$f":"IF(IF(ISNA(VLOOKUP(Lists!C8,Equipment!$B$5:$C$497,2,FALSE)),0,VLOOKUP(Lists!C8,Equipment!$B$5:$C$497,2,FALSE))=0,COUNTIF(Equipment!$B$5:$B$497,Lists!C8),VLOOKUP(Lists!C8,Equipment!$B$5:$C$497,2,FALSE))&\": \"&Lists!C8","v":"0: Pressure Separator"},null,null,null,null,{"$f":"SUMPRODUCT((MONTH('Flash Test Results'!$C$9:$C$109)=MONTH(DATEVALUE(N19&\" 1\")))*('Flash Test Results'!$C$9:$C$109<>\"\"))&\": \"&N19&\" \"&'Facility Information'!$C$32","v":"0: July "},"July",6]
[null,null,null,null,null,null,null,{"$f":"IF(IF(ISNA(VLOOKUP(Lists!C9,Equipment!$B$5:$C$497,2,FALSE)),0,VLOOKUP(Lists!C9,Equipment!$B$5:$C$497,2,FALSE))=0,COUNTIF(Equipment!$B$5:$B$497,Lists!C9),VLOOKUP(Lists!C9,Equipment!$B$5:$C$497,2,FALSE))&\": \"&Lists!C9","v":"0: Reciprocating Natural Gas Compressor"},null,null,null,null,{"$f":"SUMPRODUCT((MONTH('Flash Test Results'!$C$9:$C$109)=MONTH(DATEVALUE(N20&\" 1\")))*('Flash Test Results'!$C$9:$C$109<>\"\"))&\": \"&N20&\" \"&'Facility Information'!$C$32","v":"0: Aug "},"Aug",7]
[null,null,null,null,null,null,null,{"$f":"IF(IF(ISNA(VLOOKUP(Lists!C10,Equipment!$B$5:$C$497,2,FALSE)),0,VLOOKUP(Lists!C10,Equipment!$B$5:$C$497,2,FALSE))=0,COUNTIF(Equipment!$B$5:$B$497,Lists!C10),VLOOKUP(Lists!C10,Equipment!$B$5:$C$497,2,FALSE))&\": \"&Lists!C10","v":"0: Separator"},null,null,null,null,{"$f":"SUMPRODUCT((MONTH('Flash Test Results'!$C$9:$C$109)=MONTH(DATEVALUE(N21&\" 1\")))*('Flash Test Results'!$C$9:$C$109<>\"\"))&\": \"&N21&\" \"&'Facility Information'!$C$32","v":"0: Sep "},"Sep",8]
[null,null,null,null,null,null,null,{"$f":"IF(IF(ISNA(VLOOKUP(Lists!C11,Equipment!$B$5:$C$497,2,FALSE)),0,VLOOKUP(Lists!C11,Equipment!$B$5:$C$497,2,FALSE))=0,COUNTIF(Equipment!$B$5:$B$497,Lists!C11),VLOOKUP(Lists!C11,Equipment!$B$5:$C$497,2,FALSE))&\": \"&Lists!C11","v":"0: Sump"},null,null,null,null,{"$f":"SUMPRODUCT((MONTH('Flash Test Results'!$C$9:$C$109)=MONTH(DATEVALUE(N22&\" 1\")))*('Flash Test Results'!$C$9:$C$109<>\"\"))&\": \"&N22&\" \"&'Facility Information'!$C$32","v":"0: Oct "},"Oct",9]
[null,null,null,null,null,null,null,{"$f":"IF(IF(ISNA(VLOOKUP(Lists!C13,Equipment!$B$5:$C$497,2,FALSE)),0,VLOOKUP(Lists!C13,Equipment!$B$5:$C$497,2,FALSE))=0,COUNTIF(Equipment!$B$5:$B$497,Lists!C13),VLOOKUP(Lists!C13,Equipment!$B$5:$C$497,2,FALSE))&\": \"&Lists!C13","v":"0: Open Well Casing Vent"},null,null,null,null,{"$f":"SUMPRODUCT((MONTH('Flash Test Results'!$C$9:$C$109)=MONTH(DATEVALUE(N23&\" 1\")))*('Flash Test Results'!$C$9:$C$109<>\"\"))&\": \"&N23&\" \"&'Facility Information'!$C$32","v":"0: Nov "},"Nov",10]
[null,null,null,null,null,null,null,null,null,null,null,null,{"$f":"SUMPRODUCT((MONTH('Flash Test Results'!$C$9:$C$109)=MONTH(DATEVALUE(N24&\" 1\")))*('Flash Test Results'!$C$9:$C$109<>\"\"))&\": \"&N24&\" \"&'Facility Information'!$C$32","v":"0: Dec "},"Dec",11]

{"sheet":"Facility Information","index":3,"n_rows":36,"n_cols":5,"rows_kept":36,"cut":false,"hidden":true,"merged":[[35,1,35,2]]}
[null,"Facility Name and Contact Information"]
[]
[null,{"$f":"D4+D15+D18+D23+D28+D32+D34","v":20}]
[null,"Facility Name:",null,{"$f":"COUNTBLANK(C4:C9)","v":6},"Facility Name and Contact Information"]
[null,"Owner/Operator Name:"]
[null,"Contact Name:"]
[null,"Contact Email:"]
[null,"Contact Phone:"]
[null,"Air District:"]
[null,"Air District Facility ID (if applicable):"]
[null,"Air District Facility ID (if applicable):"]
[null,"Air District Facility ID (if applicable):"]
[null,"Air District Facility ID (if applicable):"]
[null,"Air District Facility ID (if applicable):"]
[null,"Underground Natural Gas Storage Facility (Y/N)",null,{"$f":"COUNTBLANK(C15)","v":1},"Underground Storage Designation"]
[]
[null,"Facility Location",null,{"$f":"DATEVALUE(\"1/1/\"&C32)","v":{"$error":"#VALUE!"}},{"$f":"DATEVALUE(\"12/31/\"&C32)","v":{"$error":"#VALUE!"}}]
[null,"Facility Street:",null,{"$f":"COUNTBLANK(C18:C20)","v":3},"Facility Location"]
[null,"Facility City:"]
[null,"Facility Zip:"]
[]
[null,"Facility Mailing Address"]
[null,"Street:",null,{"$f":"COUNTBLANK(C23:C26)","v":4},"Facility Mailing Address"]
[null,"City:"]
[null,"State:"]
[null,"ZIP/Postal Code:"]
[]
[null,"Preparer's Name:",null,{"$f":"COUNTBLANK(C28:C30)","v":3},"Preparer's Information"]
[null,"Preparer's e-Mail:"]
[null,"Preparer's Phone:"]
{"$rows_left_out":7}
{"sheet":"Tank Systems","index":4,"n_rows":5,"n_cols":8,"rows_kept":5,"cut":false,"hidden":true,"merged":[[1,1,1,7],[2,1,2,7]]}
[]
[null,"Instructions:  Enter a unique ID for each tank system at the facility and enter the number of wells and annual throughput for each system.  Each of the individual tanks found within the tank system are inputted in the Equipment Form along with other equipment.  If the facility does not have a tank system, you may leave the Tank System ID blank and input the individual equipment in the Equipment Form. Please note: you must input a Tank System ID in order for the Flash Analaysis test data Form to appear in the main dashboard."]
[null,"A tank system is defined in the regulation as the first separator in a crude oil or natural gas production system and any tank or sump connected directly to the first separator. In many cases, this will be a Wash Tank and the oil and water tanks that are connected directly to the Wash Tank.  There may be additional tanks or pressure separators found in the tank system, and all of those units must be inputted individually under the Equipment Form."]
[]
[null,"Tank System ID\nUnique Facility Identifier for each Tank System ID","Production Type","Number of Wells","Annual Crude Oil Throughput (bbls)","Annual Condensate Throughput (bbls)","Annual Natural Gas Throughput (MMcf)","Annual Produced Water Throughput (bbls)"]

{"sheet":"Equipment","index":5,"n_rows":2497,"n_cols":16,"rows_kept":2497,"cut":false,"hidden":true,"merged":[[2,12,2,15],[1,1,1,15]]}
[]
[null,"Instructions:  To input equipment in this spreadsheet, begin by clicking on the dropdown menu located inside the Equipment Type box.  Select the  type of equipment to input.  Please do not enter other types of equipment that are not listed in the dropdown menu.  Depending on the equipment type chosen, some cells will highlight in yellow and others will black out to signify which columns need to completed.  All cells highlighted in yellow must be filled in.  Please notice the Size Unit column, which will identify the proper measurement units for some equipment. "]
[null,null,null,null,null,null,null,null,null,null,null,null,"If required by local District rule"]
[null,"Equipment Type","Count","Equipment ID\nUnique Facility Identifier for each Equipment ID","Permitted?\n(If required by air district)","Permit ID\n(If required by air district)","Tank System ID","Tank Contents","Is Vapor Recovery Installed?","Size","Size Unit","Equipment subject to requirements of standards in section 95668 (Y/N)","Latitude","Longitude","UTM East","UTM North"]
[null,null,null,null,null,null,null,null,null,null,{"$f":"_xlfn.IFNA((VLOOKUP($B5,Lists!$C$2:$D$13,2,FALSE)),\"\")","v":""}]
[null,null,null,null,null,null,null,null,null,null,{"$f":"_xlfn.IFNA((VLOOKUP($B6,Lists!$C$2:$D$13,2,FALSE)),\"\")","v":""}]
[null,null,null,null,null,null,null,null,null,null,{"$f":"_xlfn.IFNA((VLOOKUP($B7,Lists!$C$2:$D$13,2,FALSE)),\"\")","v":""}]
[null,null,null,null,null,null,null,null,null,null,{"$f":"_xlfn.IFNA((VLOOKUP($B8,Lists!$C$2:$D$13,2,FALSE)),\"\")","v":""}]
[null,null,null,null,null,null,null,null,null,null,{"$f":"_xlfn.IFNA((VLOOKUP($B9,Lists!$C$2:$D$13,2,FALSE)),\"\")","v":""}]
[null,null,null,null,null,null,null,null,null,null,{"$f":"_xlfn.IFNA((VLOOKUP($B10,Lists!$C$2:$D$13,2,FALSE)),\"\")","v":""}]
[null,null,null,null,null,null,null,null,null,null,{"$f":"_xlfn.IFNA((VLOOKUP($B11,Lists!$C$2:$D$13,2,FALSE)),\"\")","v":""}]
[null,null,null,null,null,null,null,null,null,null,{"$f":"_xlfn.IFNA((VLOOKUP($B12,Lists!$C$2:$D$13,2,FALSE)),\"\")","v":""}]
[null,null,null,null,null,null,null,null,null,null,{"$f":"_xlfn.IFNA((VLOOKUP($B13,Lists!$C$2:$D$13,2,FALSE)),\"\")","v":""}]
[null,null,null,null,null,null,null,null,null,null,{"$f":"_xlfn.IFNA((VLOOKUP($B14,Lists!$C$2:$D$13,2,FALSE)),\"\")","v":""}]
[null,null,null,null,null,null,null,null,null,null,{"$f":"_xlfn.IFNA((VLOOKUP($B15,Lists!$C$2:$D$13,2,FALSE)),\"\")","v":""}]
[null,null,null,null,null,null,null,null,null,null,{"$f":"_xlfn.IFNA((VLOOKUP($B16,Lists!$C$2:$D$13,2,FALSE)),\"\")","v":""}]
[null,null,null,null,null,null,null,null,null,null,{"$f":"_xlfn.IFNA((VLOOKUP($B17,Lists!$C$2:$D$13,2,FALSE)),\"\")","v":""}]
[null,null,null,null,null,null,null,null,null,null,{"$f":"_xlfn.IFNA((VLOOKUP($B18,Lists!$C$2:$D$13,2,FALSE)),\"\")","v":""}]
[null,null,null,null,null,null,null,null,null,null,{"$f":"_xlfn.IFNA((VLOOKUP($B19,Lists!$C$2:$D$13,2,FALSE)),\"\")","v":""}]
[null,null,null,null,null,null,null,null,null,null,{"$f":"_xlfn.IFNA((VLOOKUP($B20,Lists!$C$2:$D$13,2,FALSE)),\"\")","v":""}]
[null,null,null,null,null,null,null,null,null,null,{"$f":"_xlfn.IFNA((VLOOKUP($B21,Lists!$C$2:$D$13,2,FALSE)),\"\")","v":""}]
[null,null,null,null,null,null,null,null,null,null,{"$f":"_xlfn.IFNA((VLOOKUP($B22,Lists!$C$2:$D$13,2,FALSE)),\"\")","v":""}]
[null,null,null,null,null,null,null,null,null,null,{"$f":"_xlfn.IFNA((VLOOKUP($B23,Lists!$C$2:$D$13,2,FALSE)),\"\")","v":""}]
[null,null,null,null,null,null,null,null,null,null,{"$f":"_xlfn.IFNA((VLOOKUP($B24,Lists!$C$2:$D$13,2,FALSE)),\"\")","v":""}]
[null,null,null,null,null,null,null,null,null,null,{"$f":"_xlfn.IFNA((VLOOKUP($B25,Lists!$C$2:$D$13,2,FALSE)),\"\")","v":""}]
[null,null,null,null,null,null,null,null,null,null,{"$f":"_xlfn.IFNA((VLOOKUP($B26,Lists!$C$2:$D$13,2,FALSE)),\"\")","v":""}]
[null,null,null,null,null,null,null,null,null,null,{"$f":"_xlfn.IFNA((VLOOKUP($B27,Lists!$C$2:$D$13,2,FALSE)),\"\")","v":""}]
[null,null,null,null,null,null,null,null,null,null,{"$f":"_xlfn.IFNA((VLOOKUP($B28,Lists!$C$2:$D$13,2,FALSE)),\"\")","v":""}]
[null,null,null,null,null,null,null,null,null,null,{"$f":"_xlfn.IFNA((VLOOKUP($B29,Lists!$C$2:$D$13,2,FALSE)),\"\")","v":""}]
[null,null,null,null,null,null,null,null,null,null,{"$f":"_xlfn.IFNA((VLOOKUP($B30,Lists!$C$2:$D$13,2,FALSE)),\"\")","v":""}]
{"$rows_left_out":2468}
{"sheet":"Flash Test Results","index":6,"n_rows":109,"n_cols":20,"rows_kept":109,"cut":false,"hidden":true,"merged":[[2,1,2,13],[4,1,4,13],[6,3,6,10],[6,11,6,17]]}
[null,"Flash Analysis Testing"]
[]
[null,"Instructions:  This spreadsheet is used for inputting flash analysis test data obtained at the facility listed under the Facilit Information tab.  Input data into a single row for each separator and tank system tested.  "]
[]
[null,"NOTE: Do not add or delete rows or alter the format of the table below.  Altering the table will result in data errors and could make this workbook unusable. "]
[]
[null,null,null,"Crude Oil or Condensate Samples",null,null,null,null,null,null,null,"Produced Water Samples"]
[null,"Tank System ID","Reporting Date","API Gravity","GOR               (scf/bbl)","MW                      (g/g-mole)","WT% CH4 (decimal)","Sample Temp         (Deg F)","Sample Pressure (psia)","Throughput (bbl/day)","MTCH4/Yr","GWR               (scf/bbl)","MW                      (g/g-mole)","WT% CH4 (decimal)","Sample Temp         (Deg F)","Sample Pressure (psia)","Throughput (bbl/day)","MTCH4/Yr","Days in Operation Per Year","Combined Emissions (MTCH4/Yr)"]
[null,null,null,null,null,null,null,null,null,null,{"$f":"((E9*J9*S9)*F9*(1/23.69)*28.317*(1/454))*G9*(1/2205)","v":0},null,null,null,null,null,null,{"$f":"((L9*Q9*S9)*M9*(1/23.69)*28.317*(1/454))*N9*(1/2205)","v":0},null,{"$f":"K9+R9","v":0}]
[null,null,null,null,null,null,null,null,null,null,{"$f":"((E10*J10*S10)*F10*(1/23.69)*28.317*(1/454))*G10*(1/2205)","v":0},null,null,null,null,null,null,{"$f":"((L10*Q10*S10)*M10*(1/23.69)*28.317*(1/454))*N10*(1/2205)","v":0},null,{"$f":"K10+R10","v":0}]
[null,null,null,null,null,null,null,null,null,null,0,null,null,null,null,null,null,0,null,0]
[null,null,null,null,null,null,null,null,null,null,0,null,null,null,null,null,null,0,null,0]
[null,null,null,null,null,null,null,null,null,null,0,null,null,null,null,null,null,0,null,0]
[null,null,null,null,null,null,null,null,null,null,{"$f":"((E14*J14*S14)*F14*(1/23.69)*28.317*(1/454))*G14*(1/2205)","v":0},null,null,null,null,null,null,0,null,0]
[null,null,null,null,null,null,null,null,null,null,0,null,null,null,null,null,null,0,null,0]
[null,null,null,null,null,null,null,null,null,null,0,null,null,null,null,null,null,0,null,0]
[null,null,null,null,null,null,null,null,null,null,0,null,null,null,null,null,null,0,null,0]
[null,null,null,null,null,null,null,null,null,null,0,null,null,null,null,null,null,0,null,0]
[null,null,null,null,null,null,null,null,null,null,0,null,null,null,null,null,null,0,null,0]
[null,null,null,null,null,null,null,null,null,null,0,null,null,null,null,null,null,0,null,0]
[null,null,null,null,null,null,null,null,null,null,0,null,null,null,null,null,null,0,null,0]
[null,null,null,null,null,null,null,null,null,null,0,null,null,null,null,null,null,0,null,0]
[null,null,null,null,null,null,null,null,null,null,0,null,null,null,null,null,null,0,null,0]
[null,null,null,null,null,null,null,null,null,null,0,null,null,null,null,null,null,0,null,0]
[null,null,null,null,null,null,null,null,null,null,0,null,null,null,null,null,null,0,null,0]
[null,null,null,null,null,null,null,null,null,null,0,null,null,null,null,null,null,0,null,0]
[null,null,null,null,null,null,null,null,null,null,0,null,null,null,null,null,null,0,null,0]
[null,null,null,null,null,null,null,null,null,null,0,null,null,null,null,null,null,0,null,0]
[null,null,null,null,null,null,null,null,null,null,0,null,null,null,null,null,null,0,null,0]
[null,null,null,null,null,null,null,null,null,null,0,null,null,null,null,null,null,0,null,0]
{"$rows_left_out":80}
{"sheet":"Lists","index":7,"n_rows":51,"n_cols":18,"rows_kept":51,"cut":false,"hidden":true,"merged":[]}
["Prod_Type","ogmethane","Equip_Type","Units",null,"YN",null,"email",null,"Select Tank System",null,"Air Districts",null,"Year",null,"Tank Contents",null,"States"]
["Crude Oil Production",null,"Centrifugal Natural Gas Compressor","HP",null,"Yes",null,"oilandgas@arb.ca.gov",null,"NA",null,"AMADOR COUNTY APCD",null,2016,null,"Oil",null,"AL"]
["Natural Gas Production",null,"Continuous High Bleed Pneumatic Devices"," ",null,"No",null,null,null,null,null,"ANTELOPE VALLEY AQMD",null,2017,null,"Water",null,"AK"]
["Natural Gas Storage",null,"Continuous Low Bleed Pneumatic Devices"," ",null,"NA",null,null,null,null,null,"BAY AREA AQMD",null,2018,null,"Condensate",null,"AZ"]
[null,null,"Intermittent Bleed Pneumatic Devices"," ",null,null,null,null,null,null,null,"BUTTE COUNTY AQMD",null,2019,null,null,null,"AR"]
[null,null,"Pneumatic Pumps"," ",null,null,null,null,null,null,null,"CALAVERAS COUNTY APCD",null,2020,null,null,null,"CA"]
[null,null,"Pond","SQFT",null,null,null,null,null,null,null,"COLUSA COUNTY APCD",null,2021,null,null,null,"CO"]
[null,null,"Pressure Separator","BBL",null,null,null,null,null,null,null,"EL DORADO COUNTY AQMD",null,2022,null,null,null,"CT"]
[null,null,"Reciprocating Natural Gas Compressor","HP",null,null,null,null,null,null,null,"FEATHER RIVER AQMD",null,2023,null,null,null,"DE"]
[null,null,"Separator","BBL",null,null,null,null,null,null,null,"GLENN COUNTY APCD",null,null,null,null,null,"FL"]
[null,null,"Sump","SQFT",null,null,null,null,null,null,null,"GREAT BASIN UNIFIED APCD",null,null,null,null,null,"GA"]
[null,null,"Tank","BBL",null,null,null,null,null,null,null,"IMPERIAL COUNTY APCD",null,null,null,null,null,"HI"]
[null,null,"Open Well Casing Vent"," ",null,null,null,null,null,null,null,"KERN COUNTY APCD",null,null,null,null,null,"ID"]
[null,null,null,null,null,null,null,null,null,null,null,"LAKE COUNTY AQMD",null,null,null,null,null,"IL"]
[null,null,null,null,null,null,null,null,null,null,null,"LASSEN COUNTY APCD",null,null,null,null,null,"IN"]
[null,null,null,null,null,null,null,null,null,null,null,"MARIPOSA COUNTY APCD",null,null,null,null,null,"IA"]
[null,null,null,null,null,null,null,null,null,null,null,"MENDOCINO COUNTY AQMD",null,null,null,null,null,"KS"]
[null,null,null,null,null,null,null,null,null,null,null,"MODOC COUNTY APCD",null,null,null,null,null,"KY"]
[null,null,null,null,null,null,null,null,null,null,null,"MOJAVE DESERT AQMD",null,null,null,null,null,"LA"]
[null,null,null,null,null,null,null,null,null,null,null,"MONTEREY BAY UNIFIED APCD",null,null,null,null,null,"ME"]
[null,null,null,null,null,null,null,null,null,null,null,"NORTH COAST UNIFIED AQMD",null,null,null,null,null,"MD"]
[null,null,null,null,null,null,null,null,null,null,null,"NORTHERN SIERRA AQMD",null,null,null,null,null,"MA"]
[null,null,null,null,null,null,null,null,null,null,null,"NORTHERN SONOMA COUNTY APCD",null,null,null,null,null,"MI"]
[null,null,null,null,null,null,null,null,null,null,null,"PLACER COUNTY APCD",null,null,null,null,null,"MN"]
[null,null,null,null,null,null,null,null,null,null,null,"SACRAMENTO METROPOLITAN AQMD",null,null,null,null,null,"MS"]
[null,null,null,null,null,null,null,null,null,null,null,"SAN DIEGO COUNTY APCD",null,null,null,null,null,"MO"]
[null,null,null,null,null,null,null,null,null,null,null,"SAN JOAQUIN VALLEY APCD",null,null,null,null,null,"MT"]
[null,null,null,null,null,null,null,null,null,null,null,"SAN LUIS OBISPO COUNTY APCD",null,null,null,null,null,"NE"]
[null,null,null,null,null,null,null,null,null,null,null,"SANTA BARBARA COUNTY APCD",null,null,null,null,null,"NV"]
[null,null,null,null,null,null,null,null,null,null,null,"SHASTA COUNTY AQMD",null,null,null,null,null,"NH"]
{"$rows_left_out":21}