{"text_format":"1","workbook":"xlsx","n_sheets":3,"sheets":["Instructions","Emissions Estimator","Fee Estimator"],"not_rendered":{"charts":0,"images":0,"macros":1,"external_links":0,"defined_names":6,"comments":0,"pivot_tables":0},"unopened":[],"bounds":{"document_bytes":16777216,"sheet_cells":100000,"rows_first":2000,"rows_last":500,"rows_between":2000,"halvings":0,"cell_chars":16384,"cell_head_chars":4096},"cells_cut":0,"cells_raw":0,"read":"whole","date_system":"1900"}

{"sheet":"Instructions","index":0,"n_rows":36,"n_cols":22,"rows_kept":36,"cut":false,"hidden":false,"merged":[[1,1,1,12],[11,2,11,12],[4,1,4,4],[25,1,25,12],[17,1,17,12],[19,2,19,12],[21,1,21,12],[18,2,18,12],[3,1,3,12],[9,1,9,12],[10,2,10,12],[23,1,23,12],[15,1,15,12],[5,1,5,12],[6,2,6,12],[7,2,7,12],[31,1,31,12],[27,1,27,12],[32,2,32,12],[29,1,29,12],[13,1,13,12]]}
[]
[null,"The following instructions are intended to provide general guidance for using the Emissions Estimator and Fee Estimator tabs.  If you need additional assistance, please contact the District at (559) 230-6000.  "]
[]
[null,"Fields highlighted in yellow are for data entry, the remaining cells are write protected.  The spreadsheet does not check for reasonableness of the data ranges, thus, please review the accuracy of your data entry."]
[null,"Instruction  Below"]
[null,"1. Start by selecting the number of ISR phases (ISR phase = 1 calendar year) from the drop down menu to the right.",null,null,null,null,null,null,null,null,null,null,null,1,null,"ISR"]
[null,null,"A.  Drop Down Menu. Select from 10, 20, 30, 40, and 50 ISR phase project."]
[null,null,"B. Changing ISR phases. ISR phases can be changed even after a phase number has been selected and data has been entered in the emissions estimator tab. To do this select the Default option from the drop down and then select the new phase number option."]
[]
[null,"2. \"Emissions Estimator\" tab.  First type the Applicant/Business Name, Project Name and Project Location.",null,null,null,null,null,null,null,null,null,null,null,null,null,null,null,null,null,null,null,"10 Phases"]
[null,null,"A.  Project Name. If the Project does not have a specific name, please type the permit type and number.  Ex. Tract Map 6061.",null,null,null,null,null,null,null,null,null,null,null,null,null,null,null,null,null,null,"20 Phases"]
[null,null,"B.  Project Location. Please enter any of the following for Project Location: Assessor's Parcel Number, Cross Streets, the City or County issuing the discretionary permit.",null,null,null,null,null,null,null,null,null,null,null,null,null,null,null,null,null,null,"30 Phases"]
[null,null,null,null,null,null,null,null,null,null,null,null,null,null,null,null,null,null,null,null,null,"40 Phases"]
[null,"3 Construction Clean Fleet Mitigation Measure line 9. Selecting \"Yes\" from the Clean Fleet Mitigation Measure will apply the approiate percent reduction from the \"Unmitigated Baseline\".",null,null,null,null,null,null,null,null,null,null,null,null,null,null,null,null,null,null,null,"50 Phases"]
[null,null,null,null,null,null,null,null,null,null,null,null,null,null,null,null,null,null,null,null,null,"Default"]
{"$rows_left_out":22}
{"sheet":"Emissions Estimator","index":1,"n_rows":128,"n_cols":25,"rows_kept":128,"cut":false,"hidden":false,"merged":[[53,13,53,14],[54,13,54,14],[55,13,55,14],[56,13,56,14],[57,13,57,14],[58,13,58,14],[59,13,59,14],[60,13,60,14],[61,13,61,14],[10,7,10,8],[10,13,10,14],[46,13,46,14],[47,13,47,14],[48,13,48,14],[49,13,49,14],[50,13,50,14],[51,13,51,14],[52,13,52,14],[15,7,15,8],[16,7,16,8],[17,7,17,8],[18,7,18,8],[19,7,19,8],[20,7,20,8],[21,7,21,8],[22,7,22,8],[23,7,23,8],[24,7,24,8],[25,7,25,8],[36,7,36,8],[37,7,37,8],[38,7,38,8],[39,7,39,8],[0,2,0,9],[0,0,0,1],[1,0,1,1],[2,0,2,1],[3,0,3,1],[1,2,1,9],[2,2,2,9],[3,2,3,9],[64,16,64,18],[9,16,9,18],[9,0,9,2],[64,0,64,2],[64,3,64,8],[63,0,63,14],[64,9,64,14],[26,7,26,8],[27,7,27,8],[28,7,28,8],[29,7,29,8],[30,7,30,8],[11,7,11,8],[12,7,12,8],[13,7,13,8],[14,7,14,8],[40,7,40,8],[31,7,31,8],[32,7,32,8],[33,7,33,8],[34,7,34,8],[35,7,35,8],[54,7,54,8],[55,7,55,8],[46,7,46,8],[47,7,47,8],[48,7,48,8],[49,7,49,8],[50,7,50,8],[41,7,41,8],[42,7,42,8],[43,7,43,8],[44,7,44,8],[45,7,45,8],[61,7,61,8],[11,13,11,14],[12,13,12,14],[13,13,13,14],[14,13,14,14],[15,13,15,14],[16,13,16,14],[17,13,17,14],[18,13,18,14],[19,13,19,14],[20,13,20,14],[21,13,21,14],[22,13,22,14],[23,13,23,14],[24,13,24,14],[25,13,25,14],[56,7,56,8],[57,7,57,8],[58,7,58,8],[59,7,59,8],[60,7,60,8],[51,7,51,8],[52,7,52,8],[53,7,53,8],[9,9,9,14],[9,3,9,8],[8,0,8,13],[7,0,7,14],[41,13,41,14],[42,13,42,14],[43,13,43,14],[44,13,44,14],[45,13,45,14],[36,13,36,14],[37,13,37,14],[38,13,38,14],[39,13,39,14],[40,13,40,14],[31,13,31,14],[32,13,32,14],[33,13,33,14],[34,13,34,14],[35,13,35,14],[26,13,26,14],[27,13,27,14],[28,13,28,14],[29,13,29,14],[30,13,30,14]]}
["Applicant/Business Name:"]
["Project Name:"]
["Project Location:"]
["District Project ID No.:",null,null,null,null,null,null,null,null,null,null,null,null,null,null,null,null,null,null,null,null,null,null,null,"Yes"]
[null,null,null,null,null,null,null,null,null,null,null,null,null,null,null,null,null,null,null,null,null,null,null,null,"No"]
[]
[]
["Project Construction Emissions"]
["If applicant selected Construction Clean Fleet Mitigation Measure - Please select \"Yes\" from dropdown menu",null,null,null,null,null,null,null,null,null,null,null,null,null,"No","q"]
[null,null,null,"NOx",null,null,null,null,null,"PM10",null,null,null,null,null,null,"Total Achieved On-Site Reductions (tons)",null,null,null,null,null,null,{"$f":"IF(W10=\"\",\"\",W10)","v":""}]
["Project \nPhase Name","ISR Phase","Construction Start Date","Unmitigated Baseline(1)\n (TPY)","Mitigated Baseline(2)\n(TPY)","Achieved \nOn-site Reductions(3) (tons)","Required\nOff-site \nReductions(4)\n(tons)","Emission Reductions Required by Rule(5)",null,"Unmitigated Baseline(1)\n (TPY)","Mitigated Baseline(2)\n(TPY)","Achieved \nOn-site Reductions(3) (tons)","Required\nOff-site \nReductions(4)\n(tons)","Emission Reductions Required by Rule(5)",null,null,"ISR Phase","NOx","PM10"]
[null,1,null,null,{"$f":"IF($O$9=\"No\",$D12,IF($O$9=\"Yes\",ROUNDDOWN($D12*0.8,4),IF($O$9=\"\",\"\")))","v":0},{"$f":"ROUND(IF(D12=\"\",0,IF((D12-E12)<0,0,D12-E12)),4)","v":0},{"$f":"ROUND(IF(ISERROR((E12-(0.8*D12))),0,IF((E12-(0.8*D12))<=0,0,IF(D12<=0,0,(E12-(0.8*D12))))),4)","v":0},{"$f":"D12*0.2","v":0},null,null,{"$f":"IF($O$9=\"No\",$J12,IF($O$9=\"Yes\",ROUNDDOWN($J12*0.55,4),IF($O$9=\"\",\"\")))","v":0},{"$f":"ROUND(IF(J12=\"\",0,IF((J12-K12)<0,0,J12-K12)),4)","v":0},{"$f":"ROUND(IF(ISERROR(K12-(0.55*J12)),0,IF(K12-(0.55*J12)<=0,0,IF(J12<=0,0,K12-(0.55*J12)))),4)","v":0},{"$f":"J12*0.45","v":0},null,null,1,{"$f":"SUM(F12,F67)","v":0},{"$f":"SUM(L12, L67)","v":0}]
[null,{"$f":"B12+1","v":2},null,null,{"$f":"IF($O$9=\"No\",$D13,IF($O$9=\"Yes\",ROUNDDOWN($D13*0.8,4),IF($O$9=\"\",\"\")))","v":0},0,0,{"$f":"D13*0.2","v":0},null,null,0,0,0,{"$f":"J13*0.45","v":0},null,null,{"$f":"Q12+1","v":2},0,0]
[null,{"$f":"B13+1","v":3},null,null,{"$f":"IF($O$9=\"No\",$D14,IF($O$9=\"Yes\",ROUNDDOWN($D14*0.8,4),IF($O$9=\"\",\"\")))","v":0},0,0,0,null,null,0,0,0,0,null,null,{"$f":"Q13+1","v":3},0,0]
[null,4,null,null,0,0,0,0,null,null,0,0,0,0,null,null,4,0,0]
{"$rows_left_out":114}
{"sheet":"Fee Estimator","index":2,"n_rows":148,"n_cols":35,"rows_kept":148,"cut":false,"hidden":false,"merged":[[0,4,0,12],[1,4,1,12],[2,4,2,12],[3,4,3,12],[30,4,31,4],[32,4,33,4],[36,3,37,3],[11,2,11,4],[108,4,109,4],[40,3,41,3],[38,5,39,5],[38,3,39,3],[40,5,41,5],[44,4,45,4],[48,2,49,2],[16,3,17,3],[16,5,17,5],[18,2,19,2],[18,3,19,3],[16,4,17,4],[34,3,35,3],[50,3,51,3],[30,5,31,5],[36,4,37,4],[22,5,23,5],[24,2,25,2],[110,2,111,2],[110,3,111,3],[58,2,59,2],[58,3,59,3],[38,4,39,4],[40,4,41,4],[42,4,43,4],[50,2,51,2],[102,3,103,3],[60,2,61,2],[60,3,61,3],[66,4,67,4],[96,3,97,3],[98,3,99,3],[100,3,101,3],[82,3,83,3],[54,2,55,2],[54,3,55,3],[106,3,107,3],[76,4,77,4],[78,4,79,4],[80,4,81,4],[20,4,21,4],[22,4,23,4],[24,4,25,4],[84,3,85,3],[86,3,87,3],[88,3,89,3],[70,2,71,2],[22,2,23,2],[22,3,23,3],[82,4,83,4],[84,4,85,4],[74,2,75,2],[34,2,35,2],[52,3,53,3],[74,4,75,4],[92,3,93,3],[94,3,95,3],[56,4,57,4],[58,4,59,4],[60,4,61,4],[62,4,63,4],[0,2,0,3],[1,2,1,3],[2,2,2,3],[3,2,3,3],[46,4,47,4],[48,4,49,4],[50,4,51,4],[52,4,53,4],[54,4,55,4],[14,4,15,4],[12,2,12,5],[26,4,27,4],[20,2,21,2],[20,3,21,3],[20,5,21,5],[16,2,17,2],[28,3,29,3],[18,4,19,4],[28,5,29,5],[30,2,31,2],[30,3,31,3],[32,2,33,2],[32,3,33,3],[32,5,33,5],[28,2,29,2],[26,3,27,3],[26,5,27,5],[125,23,125,24],[14,2,15,2],[36,2,37,2],[38,2,39,2],[40,2,41,2],[42,2,43,2],[44,2,45,2],[46,2,47,2],[121,18,121,20],[123,2,123,4],[46,5,47,5],[46,3,47,3],[48,5,49,5],[48,3,49,3],[42,5,43,5],[42,3,43,3],[44,5,45,5],[110,4,111,4],[117,2,118,2],[18,5,19,5],[28,4,29,4],[36,5,37,5],[50,5,51,5],[52,2,53,2],[52,5,53,5],[56,5,57,5],[124,18,124,19],[44,3,45,3],[110,5,111,5],[112,2,113,2],[112,3,113,3],[112,5,113,5],[64,2,65,2],[64,3,65,3],[64,5,65,5],[66,2,67,2],[66,3,67,3],[66,5,67,5],[108,2,109,2],[108,3,109,3],[108,5,109,5],[64,4,65,4],[62,2,63,2],[62,3,63,3],[62,5,63,5],[54,5,55,5],[56,2,57,2],[56,3,57,3],[141,9,141,11],[144,9,144,11],[145,9,145,11],[138,9,138,11],[147,9,147,11],[133,7,133,11],[134,7,134,11],[135,7,135,11],[136,7,136,11],[146,9,146,11],[129,9,129,11],[130,9,130,11],[139,9,139,11],[140,9,140,11],[58,5,59,5],[96,5,97,5],[98,5,99,5],[100,5,101,5],[102,5,103,5],[104,5,105,5],[106,5,107,5],[88,7,88,8],[68,7,68,8],[78,7,78,8],[79,7,79,8],[80,7,80,8],[81,7,81,8],[70,7,70,8],[71,7,71,8],[72,7,72,8],[74,7,74,8],[73,7,73,8],[75,7,75,8],[82,7,82,8],[12,7,12,10],[82,5,83,5],[84,5,85,5],[86,5,87,5],[88,5,89,5],[90,5,91,5],[92,5,93,5],[94,5,95,5],[76,7,76,8],[77,7,77,8],[34,5,35,5],[69,7,69,8],[60,5,61,5],[91,7,91,8],[92,7,92,8],[93,7,93,8],[94,7,94,8],[95,7,95,8],[45,7,45,8],[46,7,46,8],[58,7,58,8],[57,7,57,8],[56,7,56,8],[55,7,55,8],[112,4,113,4],[114,2,115,4],[127,9,127,11],[128,9,128,11],[84,2,85,2],[86,2,87,2],[88,2,89,2],[90,2,91,2],[92,2,93,2],[94,2,95,2],[96,2,97,2],[98,2,99,2],[100,2,101,2],[102,2,103,2],[104,2,105,2],[106,2,107,2],[104,3,105,3],[84,7,84,8],[85,7,85,8],[86,7,86,8],[87,7,87,8],[102,4,103,4],[89,7,89,8],[90,3,91,3],[90,7,90,8],[76,2,77,2],[78,2,79,2],[80,2,81,2],[68,5,69,5],[70,5,71,5],[72,5,73,5],[74,5,75,5],[76,5,77,5],[78,5,79,5],[80,5,81,5],[68,3,69,3],[70,3,71,3],[72,3,73,3],[74,3,75,3],[76,3,77,3],[78,3,79,3],[80,3,81,3],[82,2,83,2],[68,4,69,4],[70,4,71,4],[72,4,73,4],[83,7,83,8],[104,4,105,4],[106,4,107,4],[68,2,69,2],[72,2,73,2],[96,7,96,8],[97,7,97,8],[98,7,98,8],[99,7,99,8],[100,7,100,8],[101,7,101,8],[102,7,102,8],[103,7,103,8],[104,7,104,8],[105,7,105,8],[106,7,106,8],[107,7,107,8],[86,4,87,4],[88,4,89,4],[90,4,91,4],[92,4,93,4],[94,4,95,4],[96,4,97,4],[98,4,99,4],[100,4,101,4],[108,7,108,8],[109,7,109,8],[110,7,110,8],[111,7,111,8],[112,7,112,8],[113,7,113,8],[114,7,114,8],[115,7,115,8],[117,7,117,8],[118,7,118,8],[13,7,13,8],[14,7,14,8],[15,7,15,8],[16,7,16,8],[17,7,17,8],[18,7,18,8],[19,7,19,8],[20,7,20,8],[21,7,21,8],[22,7,22,8],[23,7,23,8],[66,7,66,8],[67,7,67,8],[65,7,65,8],[64,7,64,8],[63,7,63,8],[62,7,62,8],[61,7,61,8],[60,7,60,8],[59,7,59,8],[54,7,54,8],[53,7,53,8],[52,7,52,8],[51,7,51,8],[50,7,50,8],[25,7,25,8],[26,7,26,8],[27,7,27,8],[24,7,24,8],[48,7,48,8],[49,7,49,8],[47,7,47,8],[37,7,37,8],[38,7,38,8],[39,7,39,8],[40,7,40,8],[28,7,28,8],[29,7,29,8],[30,7,30,8],[31,7,31,8],[32,7,32,8],[33,7,33,8],[34,7,34,8],[35,7,35,8],[36,7,36,8],[41,7,41,8],[42,7,42,8],[43,7,43,8],[44,7,44,8],[14,0,15,0],[16,0,17,0],[18,0,19,0],[20,0,21,0],[22,0,23,0],[24,0,25,0],[26,0,27,0],[28,0,29,0],[30,0,31,0],[32,0,33,0],[34,0,35,0],[36,0,37,0],[38,0,39,0],[40,0,41,0],[42,0,43,0],[44,0,45,0],[14,5,15,5],[14,3,15,3],[34,4,35,4],[24,3,25,3],[24,5,25,5],[26,2,27,2],[46,0,47,0],[48,0,49,0],[50,0,51,0],[52,0,53,0],[54,0,55,0],[56,0,57,0],[58,0,59,0],[60,0,61,0],[62,0,63,0],[64,0,65,0],[66,0,67,0],[68,0,69,0],[70,0,71,0],[72,0,73,0],[74,0,75,0],[76,0,77,0],[78,0,79,0],[80,0,81,0],[82,0,83,0],[84,0,85,0],[86,0,87,0],[88,0,89,0],[90,0,91,0],[92,0,93,0],[94,0,95,0],[96,0,97,0],[98,0,99,0],[100,0,101,0],[102,0,103,0],[104,0,105,0],[106,0,107,0],[108,0,109,0],[110,0,111,0],[112,0,113,0],[14,1,15,1],[16,1,17,1],[18,1,19,1],[20,1,21,1],[22,1,23,1],[24,1,25,1],[26,1,27,1],[28,1,29,1],[30,1,31,1],[32,1,33,1],[34,1,35,1],[36,1,37,1],[38,1,39,1],[40,1,41,1],[42,1,43,1],[44,1,45,1],[46,1,47,1],[48,1,49,1],[50,1,51,1],[52,1,53,1],[54,1,55,1],[56,1,57,1],[58,1,59,1],[60,1,61,1],[62,1,63,1],[64,1,65,1],[66,1,67,1],[68,1,69,1],[70,1,71,1],[72,1,73,1],[74,1,75,1],[76,1,77,1],[78,1,79,1],[80,1,81,1],[82,1,83,1],[84,1,85,1],[86,1,87,1],[106,1,107,1],[108,1,109,1],[110,1,111,1],[112,1,113,1],[88,1,89,1],[90,1,91,1],[92,1,93,1],[94,1,95,1],[96,1,97,1],[98,1,99,1],[100,1,101,1],[102,1,103,1],[104,1,105,1]]}
[null,null,"Applicant/Business Name:",null,{"$f":"IF('Emissions Estimator'!C1=\"\",\"\",'Emissions Estimator'!C1)","v":""}]
[null,null,"Project Name:",null,{"$f":"IF('Emissions Estimator'!C2=\"\",\"\",'Emissions Estimator'!C2)","v":""}]
[null,null,"Project Location:",null,{"$f":"IF('Emissions Estimator'!C3=\"\",\"\",'Emissions Estimator'!C3)","v":""}]
[null,null,"District Project ID No.:",null,{"$f":"IF('Emissions Estimator'!C4=\"\",\"\",'Emissions Estimator'!C4)","v":""}]
[]
[null,null,"NOTES:"]
[null,null,"(1) The start date for each ISR phase is shown in TABLE 1."]
[null,null,"(2) If you have chosen a ONE-TIME payment for the project, then the total amount due for ALL PHASES is shown under TABLE 2."]
[null,null,"(3) If you have chosen a DEFERRED payment schedule or would like to propose a DEFERRED payment schedule for the project, the total amount due for a specific year is shown in TABLE 3 according to the schedule in TABLE 1."]
[null,null,"* If you have not provided a proposed payment date, the District sets a default invoice date of 60 days prior to start of the ISR phase."]
[]
[null,null,"If applicant selected Fee Deferral Schedule -  \nPlease select \"Yes\" from dropdown menu",null,null,"Yes","q"]
[null,null,"TABLE 1 - PROJECT INFORMATION",null,null,null,null,"TABLE 2 -                                                                          No Fee Deferral Schedule (FDS)",null,null,null,null,"TABLE 2 - NO  FDS ",null,null,null,"                                               TABLE 3 - APPROVED FEE DEFERRAL SCHEDULE (FDS) BY PAYMENT YEAR "]
["Phase Type","Construction Clean Fleet Selected","Project \nPhase Name","ISR \nPhase","\nStart Date\nper Phase","Scheduled\nPayment\nDate*",null,"Pollutant",null,"Required\nReductions\n (tons)","Required Offsite Reductions (tons)",null,2022,null,2018,2019,2022,{"$f":"Q14+1","v":2023},{"$f":"R14+1","v":2024},2025,2026,2027,2028,2029,2030,2031,2032,2033,2034,2035,2036,2037,2038,2039,2040]
[{"$f":"IF(AND('Emissions Estimator'!$A12=\"\",'Emissions Estimator'!$A67=\"\"),\"\",IF(AND('Emissions Estimator'!$A12=\"\",'Emissions Estimator'!$A67<>\"\"),\"Operation\",IF(AND('Emissions Estimator'!$A67=\"\",'Emissions Estimator'!$A12<>\"\"),\"Construction\",MIN('Emissions Estimator'!$A12,'Emissions Estimator'!$A67))))","v":""},{"$f":"IF(A15=\"\",\"\",IF(AND(A15=\"Construction\",'Emissions Estimator'!$O$9=\"No\"),\"No\",IF(AND(A15=\"Construction\",'Emissions Estimator'!$O$9=\"Yes\"),\"Yes\",IF(A15=\"Operation\",\"\"))))","v":""},{"$f":"IF(AND('Emissions Estimator'!$A12=\"\",'Emissions Estimator'!$A67=\"\"),\"\",IF(AND('Emissions Estimator'!$A12=\"\",'Emissions Estimator'!$A67<>\"\"),'Emissions Estimator'!$A67,IF(AND('Emissions Estimator'!$A67=\"\",'Emissions Estimator'!$A12<>\"\"),'Emissions Estimator'!$A12,MIN('Emissions Estimator'!$A12,'Emissions Estimator'!$A67))))","v":""},1,{"$f":"IF(AND('Emissions Estimator'!C12=\"\",'Emissions Estimator'!C67=\"\"),\"\",IF(AND('Emissions Estimator'!C12=\"\",'Emissions Estimator'!C67<>\"\"),'Emissions Estimator'!C67,IF(AND('Emissions Estimator'!C67=\"\",'Emissions Estimator'!C12<>\"\"),'Emissions Estimator'!C12,MIN('Emissions Estimator'!C12,'Emissions Estimator'!C67))))","v":""},{"$f":"IF(AND(B15=\"\",E15=\"\"),\"\",IF(AND(B15=\"Yes\",$F$12=\"Yes\"),\"Clean Fleet\",IF(AND(B15=\"Yes\",$F$12=\"No\"),\"Clean Fleet\",IF(AND(A15=\"Operation\",$F$12=\"No\"),$E$15-1,IF(AND(A15=\"Operation\",$F$12=\"Yes\"),E15-1,IF(AND(B15=\"No\",$F$12=\"No\"),$E$15-1,IF(AND(B15=\"No\",$F$12=\"Yes\"),E15-1)))))))","v":""},null,"NOx",null,{"$f":"('Emissions Estimator'!R67)","v":0},{"$f":"IF(SUM(Q15:AI15)<J15,J15-SUM(Q15:AI15),IF(SUM(Q15:AI15)>J15,J15-SUM(Q15:AI15),SUM(Q15:AI15)))","v":0},null,{"$f":"J15","v":0},null,{"$f":"IF(ISTEXT('Fee Estimator'!$F15),0,IF('Fee Estimator'!$F15=\"\",0,IF($F$12=\"No\",0,IF(O$14=YEAR('Fee Estimator'!$F15),'Fee Estimator'!$M15,0))))","v":0},{"$f":"IF(ISTEXT('Fee Estimator'!$F15),0,IF('Fee Estimator'!$F15=\"\",0,IF($F$12=\"No\",0,IF(P$14=YEAR('Fee Estimator'!$F15),'Fee Estimator'!$M15,0))))","v":0},{"$f":"IF(ISTEXT('Fee Estimator'!$F15),0,IF('Fee Estimator'!$F15=\"\",0,IF($F$12=\"No\",0,IF(Q$14=YEAR('Fee Estimator'!$F15),'Fee Estimator'!$M15,0))))","v":0},{"$f":"IF(ISTEXT('Fee Estimator'!$F15),0,IF('Fee Estimator'!$F15=\"\",0,IF($F$12=\"No\",0,IF(R$14=YEAR('Fee Estimator'!$F15),'Fee Estimator'!$M15,0))))","v":0},{"$f":"IF(ISTEXT('Fee Estimator'!$F15),0,IF('Fee Estimator'!$F15=\"\",0,IF($F$12=\"No\",0,IF(S$14=YEAR('Fee Estimator'!$F15),'Fee Estimator'!$M15,0))))","v":0},{"$f":"IF(ISTEXT('Fee Estimator'!$F15),0,IF('Fee Estimator'!$F15=\"\",0,IF($F$12=\"No\",0,IF(T$14=YEAR('Fee Estimator'!$F15),'Fee Estimator'!$M15,0))))","v":0},{"$f":"IF(ISTEXT('Fee Estimator'!$F15),0,IF('Fee Estimator'!$F15=\"\",0,IF($F$12=\"No\",0,IF(U$14=YEAR('Fee Estimator'!$F15),'Fee Estimator'!$M15,0))))","v":0},{"$f":"IF(ISTEXT('Fee Estimator'!$F15),0,IF('Fee Estimator'!$F15=\"\",0,IF($F$12=\"No\",0,IF(V$14=YEAR('Fee Estimator'!$F15),'Fee Estimator'!$M15,0))))","v":0},{"$f":"IF(ISTEXT('Fee Estimator'!$F15),0,IF('Fee Estimator'!$F15=\"\",0,IF($F$12=\"No\",0,IF(W$14=YEAR('Fee Estimator'!$F15),'Fee Estimator'!$M15,0))))","v":0},{"$f":"IF(ISTEXT('Fee Estimator'!$F15),0,IF('Fee Estimator'!$F15=\"\",0,IF($F$12=\"No\",0,IF(X$14=YEAR('Fee Estimator'!$F15),'Fee Estimator'!$M15,0))))","v":0},{"$f":"IF(ISTEXT('Fee Estimator'!$F15),0,IF('Fee Estimator'!$F15=\"\",0,IF($F$12=\"No\",0,IF(Y$14=YEAR('Fee Estimator'!$F15),'Fee Estimator'!$M15,0))))","v":0},{"$f":"IF(ISTEXT('Fee Estimator'!$F15),0,IF('Fee Estimator'!$F15=\"\",0,IF($F$12=\"No\",0,IF(Z$14=YEAR('Fee Estimator'!$F15),'Fee Estimator'!$M15,0))))","v":0},{"$f":"IF(ISTEXT('Fee Estimator'!$F15),0,IF('Fee Estimator'!$F15=\"\",0,IF($F$12=\"No\",0,IF(AA$14=YEAR('Fee Estimator'!$F15),'Fee Estimator'!$M15,0))))","v":0},{"$f":"IF(ISTEXT('Fee Estimator'!$F15),0,IF('Fee Estimator'!$F15=\"\",0,IF($F$12=\"No\",0,IF(AB$14=YEAR('Fee Estimator'!$F15),'Fee Estimator'!$M15,0))))","v":0},{"$f":"IF(ISTEXT('Fee Estimator'!$F15),0,IF('Fee Estimator'!$F15=\"\",0,IF($F$12=\"No\",0,IF(AC$14=YEAR('Fee Estimator'!$F15),'Fee Estimator'!$M15,0))))","v":0},{"$f":"IF(ISTEXT('Fee Estimator'!$F15),0,IF('Fee Estimator'!$F15=\"\",0,IF($F$12=\"No\",0,IF(AD$14=YEAR('Fee Estimator'!$F15),'Fee Estimator'!$M15,0))))","v":0},{"$f":"IF(ISTEXT('Fee Estimator'!$F15),0,IF('Fee Estimator'!$F15=\"\",0,IF($F$12=\"No\",0,IF(AE$14=YEAR('Fee Estimator'!$F15),'Fee Estimator'!$M15,0))))","v":0},{"$f":"IF(ISTEXT('Fee Estimator'!$F15),0,IF('Fee Estimator'!$F15=\"\",0,IF($F$12=\"No\",0,IF(AF$14=YEAR('Fee Estimator'!$F15),'Fee Estimator'!$M15,0))))","v":0},{"$f":"IF(ISTEXT('Fee Estimator'!$F15),0,IF('Fee Estimator'!$F15=\"\",0,IF($F$12=\"No\",0,IF(AG$14=YEAR('Fee Estimator'!$F15),'Fee Estimator'!$M15,0))))","v":0},{"$f":"IF(ISTEXT('Fee Estimator'!$F15),0,IF('Fee Estimator'!$F15=\"\",0,IF($F$12=\"No\",0,IF(AH$14=YEAR('Fee Estimator'!$F15),'Fee Estimator'!$M15,0))))","v":0},{"$f":"IF(ISTEXT('Fee Estimator'!$F15),0,IF('Fee Estimator'!$F15=\"\",0,IF($F$12=\"No\",0,IF(AI$14=YEAR('Fee Estimator'!$F15),'Fee Estimator'!$M15,0))))","v":0}]
{"$rows_left_out":133}